IRELAND
type: Concept

IE/DTO
type: Concept
in scheme: providers
definition: The DUBLIN TRANSPORTATION OFFICE was established in 1995 to coordinate the implementation by the relevant agencies of an agreed integrated transport strategy for the Greater Dublin Area, namely The Dublin Transportation Initiative that was adopted as government policy in 1994. The Vision for Dublin was to produce a practicable set of recommendations for new transport infrastructure and complimentary measures to manage projected growth in the demand for travel from all sections of the community over twenty years. It aimed not just to provide another report on a shelf but an ongoing planning process. The dto makes a continuous input to transportation planning and land use policy through a team of engineers, planners, GIS officers and administrators who specialize in Transportation Planning , Transportation Modeling , Traffic Management and Land Use Planning. Website: "http://www.dto.ie/" [Summary provided by The Dublin Transportation Office, Ireland.]