Sentinel-3A
type: Concept
change note: 2020-09-21 16:39:32.0 [sritz] Insert Concept add broader relation (Sentinel-3A [bfb3c71b-a35d-42d4-9e04-c511c8000a2e,560704] - S - U [4eb1894b-35b4-406b-8864-944a42bc7702,547487]);
change note: 2020-09-21 16:43:25.0 [sritz] insert Definition (id: null text: Sentinel-3 is primarily an ocean mission, however, the mission is also able to provide atmospheric and land applications. The mission provides data continuity for the ERS, Envisat and SPOT satellites. Sentinel-3 makes use of multiple sensing instruments to accomplish its objectives; SLSTR (Sea and Land Surface Temperature Radiometer), OLCI (Ocean and Land Colour Instrument), SRAL (SAR Altimeter), DORIS, and MWR (Microwave Radiometer). language code: en);
change note: 2020-09-21 16:42:07.0 [sritz] insert AltLabel (id: null category: primary text: Sentinel-3A language code: en);
definition: Sentinel-3 is primarily an ocean mission, however, the mission is also able to provide atmospheric and land applications. The mission provides data continuity for the ERS, Envisat and SPOT satellites. Sentinel-3 makes use of multiple sensing instruments to accomplish its objectives; SLSTR (Sea and Land Surface Temperature Radiometer), OLCI (Ocean and Land Colour Instrument), SRAL (SAR Altimeter), DORIS, and MWR (Microwave Radiometer).
in scheme: projects

S - U
type: Concept