Teledyne API Model T265 O3 Analyzer
type: Concept
change note: 2021-08-10 09:13:33.0 [tstevens] insert AltLabel (id: null category: primary text: Teledyne API Model T265 Chemiluminescence O3 Analyzer language code: en); insert Definition (id: null text: The Model T265 uses Chemiluminescence with Nitric Oxide (NO) as a reagent, making it safe, stable, and effective for all applications. The NO-CL method for Ozone has several advantages​ over the conventional UV absorption technology, including the avoidance of positive and commonly found interferences such as VOCs, fine particulates, Mercury, terpenes, ClO2 and others. If these pollutants are present in the atmosphere, it can cause UV absorption analyzers to give an artificially high ozone measurement. The innovative T265 combines speed of response, sensitivity and stability of our proven nitrogen oxide analyzer, with a simple user interface, to provide reliable ozone measurements under the harshest conditions. An inexpensive external cylinder of NO provides over one year of reagent for the T265. A unique AutoZero feature provides superb stability by continuously correcting for zero drift, while advanced Adaptive Filtering allows the analyzer to optimize performance under changing conditions. Optional zero and span valves allow automatic, unattended calibration checks. All T Series instruments offer an advanced color display, capacitive touch screen, intuitive user interface, flexible I/O, and built-in data acquisition capability. All instrument set up, control and access to stored data and diagnostic information is available through the front panel, or via RS232, Ethernet, or USB com ports, either locally or by remote connection. The Model T265 comes with NumaView™ Software. NumaView™ Remote PC Software allows for a remote connection with virtual interface and data downloading capability to analyzers operating NumaView™ Software. language code: en);
change note: 2021-08-10 09:12:22.0 [tstevens] Insert Concept add broader relation (Teledyne API Model T265 O3 Analyzer [bfd5ebc3-94d4-4f27-89da-1f549ae0ab0d,706573] - Chemical Meters/Analyzers [3d25724b-832f-4a61-b0b2-4f2ccecdba94,698163]);
in scheme: instruments
definition: The Model T265 uses Chemiluminescence with Nitric Oxide (NO) as a reagent, making it safe, stable, and effective for all applications. The NO-CL method for Ozone has several advantages​ over the conventional UV absorption technology, including the avoidance of positive and commonly found interferences such as VOCs, fine particulates, Mercury, terpenes, ClO2 and others. If these pollutants are present in the atmosphere, it can cause UV absorption analyzers to give an artificially high ozone measurement. The innovative T265 combines speed of response, sensitivity and stability of our proven nitrogen oxide analyzer, with a simple user interface, to provide reliable ozone measurements under the harshest conditions. An inexpensive external cylinder of NO provides over one year of reagent for the T265. A unique AutoZero feature provides superb stability by continuously correcting for zero drift, while advanced Adaptive Filtering allows the analyzer to optimize performance under changing conditions. Optional zero and span valves allow automatic, unattended calibration checks. All T Series instruments offer an advanced color display, capacitive touch screen, intuitive user interface, flexible I/O, and built-in data acquisition capability. All instrument set up, control and access to stored data and diagnostic information is available through the front panel, or via RS232, Ethernet, or USB com ports, either locally or by remote connection. The Model T265 comes with NumaView™ Software. NumaView™ Remote PC Software allows for a remote connection with virtual interface and data downloading capability to analyzers operating NumaView™ Software.

Chemical Meters/Analyzers
type: Concept