STAND ALONE
type: Concept
in scheme: sciencekeywords
definition: Stand alone programs are interactive programs that educators and students can use without the use of the Internet. This may include CD-ROMs, DVD’s, and downloadable programs.

INTERACTIVE PROGRAMS
type: Concept