JAPAN
type: Concept

JP/KPFES
type: Concept
in scheme: providers
definition: The management and administration of the Research Institute is handled by the General Affairs Division which oversees the following divisions and stations: 1. Research Planning and Administration Division 2. Resources and Environment Division 3. Sea-Farming technique Division 4. Ocean Information Division 5. Sagami Bay Experimental Station 6. Inland water Experimental Station Website: "http://www.agri.pref.kanagawa.jp/suisoken/index-e.html" [Summary provided by the Kanagawa Prefectural Fisheries Research Institute.]