Field Sites
type: Concept

Data Collections
type: Concept
change note: 2022-02-08 08:52:31.0 [tstevens] insert Definition (id: null text: Refers to data collected at field sites. language code: en);
change note: 2021-11-17 13:45:05.0 [tstevens] Move Concepts delete broader relation (null); add broader relation (Data Collections [c10044b3-6ebc-413a-99b7-2be30c08e507,826704] - Field Sites [ca8f355b-7f63-407d-89bb-d3a6cd10d683,835886]);
change note: 2018-08-23 14:24:50.0 [sritz] Insert Concept add broader relation (Data Collections [c10044b3-6ebc-413a-99b7-2be30c08e507,368091] - In Situ Land-based Platforms [4f396ff6-7bea-4ba4-afa3-198ebd914a4a,344951]);
in scheme: platforms
definition: Refers to data collected at field sites.