ACADEMIC
type: Concept

UC-BERKELEY/SSL/CSE
type: Concept
in scheme: providers
definition: The Center for Science Education @ Space Sciences Laboratory has earned a reputation that sets the standard for excellence in space science education and public outreach. We develop innovative programs that serve educators, students, science museums, and the general public. Website: http://cse.ssl.berkeley.edu/whoweare.html Info: Center for Science Education