MARINE ADVISORIES
type: Concept

MARINE WEATHER/FORECAST
type: Concept
in scheme: sciencekeywords
definition: Warnings and forecasts which help mariners plan and make decisions protecting life and property. Examples of this type of advisory includes information about hazardous sea conditions or lower wind speeds that may affect small craft operations, warnings for storms(ie tropical storms and hurricane warnings) Example: http://205.156.54.206/om/marine2.htm