CONSORTIA/INSTITUTIONS
type: Concept

CEREGE
type: Concept
in scheme: providers
definition: The CEREGE is a unit which develops interdisciplinary research in the disciplines of Earth sciences and the environment. Le spectre est large et touche une grande partie des axes scientifiques des départements MPPU (Sciences de la Terre) et EDD du CNRS et du Département Milieu Environnement de lIRD. The spectrum is broad and affects a large part of axes scientific departments MPPU (Earth Sciences) and ESD CNRS and the Department of Environment Midfielder IRD. Summary Provided By: http://translate.google.com/translate?hl=en&sl=fr&u=http://www.cerege.fr/&sa=X&oi=translate&resnum=1&ct=result&prev=/search%3Fq%3DCentre%2BEuropeen%2Bde%2BRecherche%2Bet%2Bd%2527Enseignement%2Bdes%2BGeosciences%2Bde%2Bl%2527Environnement%2B(CEREGE)%26hl%3Den%26client%3Dfirefox-a%26rls%3Dorg.mozilla:en-US:official%26hs%3DgLw%26sa%3DG