MULTINATIONAL ORGANIZATIONS
type: Concept

IEA/PVPS/TSK2
type: Concept
in scheme: providers
definition: The Photovoltaic Power Systems Programme is a collaborative R&D Agreement, established within the International Energy Agency, and conducting projects on the application of solar photovoltaic electricity. IEA PVPS operates worldwide via a network of national teams in member countries. This website provides information about the results of the IEA PVPS programme including publications and other project results. Summary Provided By: http://www.iea-pvps.org/