UNE-L/PANHANDLE
type: Concept
in scheme: providers
definition: The Panhandle Research and Extension Center, located in the heart of western Nebraska in Scottsbluff, houses 19 faculty with appointments in agriculture and family and consumer science through the University of Nebraska-Lincoln. Most of the faculty hold joint appointments in research and extension. The Cooperative Extension program in a 17-county area of the Panhandle and north-central Nebraska is also administered at the Center. Summary provided by: http://www.panhandle.unl.edu/about_us.htm

ACADEMIC
type: Concept