USDA
type: Concept

USDA/ARS/GRL
type: Concept
in scheme: providers
definition: The mission of the GrazingLands Research Laboratory is to enhance forage and livestock production and develop management strategies that incorporate climate risk, promote sustainability, and conserve the productivity of grazinglands resources in the Great Plains. Website: "http://grl.ars.usda.gov/" [Summary provided by the USDA.]