NON-GOVERNMENT/NON-PROFIT ORGANIZATIONS
type: Concept

TSC
type: Concept
in scheme: providers
definition: The CST is a non-governmental scientific and environmental pioneer in Costa Rica. Desde su fundación en 1962, prestigiosos científicos y profesionales, han hecho del CCT una de las instituciones más destacadas e influyentes a nivel Latinoamericano en materia de investigación y conservación de los recursos naturales. Since its founding in 1962, renowned scientists and professionals, have made the CST one of the most prominent and influential Latin American level in research and conservation of natural resources. Summary Provided By: http://translate.google.com/translate?hl=en&sl=es&u=http://www.cct.or.cr/&sa=X&oi=translate&resnum=1&ct=result&prev=/search%3Fq%3D%2BTropical%2BScience%2BCenter%26hl%3Den%26client%3Dfirefox-a%26rls%3Dorg.mozilla:en-US:official%26hs%3Dygk%26sa%3DG