USDA
type: Concept

USDA/NASS
type: Concept
in scheme: providers
definition: The USDA National Agriculture Statistics Service provides various agricultural related statistics including publications, charts, maps and historical data sets. Website: "http://www.usda.gov/nass/" [Summary provided by the USDA.]