FROZEN GROUND
type: Concept

TALIK
type: Concept
in scheme: sciencekeywords
definition: Talik, also called tabetisol, is a Russian term applied to permanently unfrozen ground in regions of permafrost.