NON-GOVERNMENT/NON-PROFIT ORGANIZATIONS
type: Concept

EWG
type: Concept
in scheme: providers
definition: Environmental investigations have been the specialty at the Environmental Working Group since 1993. Their team of scientists, engineers, policy experts, lawyers and computer programmers pores over government data, legal documents, scientific studies and our own laboratory tests to expose threats to your health and the environment, and to find solutions. Their research brings to light unsettling facts that you have a right to know. It shames and shakes up polluters and their lobbyists. It rattles politicians and shapes policy. It persuades bureaucracies to rethink science and strengthen regulation. It provides practical information you can use to protect your family and community. Website: "http://www.ewg.org/" [Summary provided by The Environmental Working Group.]