CINDY 2011
type: Concept
change note: 2013-12-12 14:24:43.0 [gee-cee] insert AltLabel (id: null text: Cooperative Indian Ocean EXperiment on intraseasonal variability in the year 2011 language code: en);
change note: 2013-12-12 14:24:01.0 [gee-cee] Insert Concept add broader relation (CINDY 2011 [c425d73d-0f4a-4691-8ff2-6d30a09c46a3,106005] - A - C [0c89f3f4-7ab1-43ce-89ee-795d35f0e30a,77505]);
in scheme: projects
definition: Background: Madden-Julian Oscillation (MJO), which is the dominant intraseasonal mode in the tropics, is known as a phenomenon which has a strong impact on not only the tropical climate but also the global climate through the interaction with El Nino, monsoon, tropical cyclone genesis, and so on. Objectives: The aim of the field experiment CINDY2011 is to collect in-situ atmospheric and oceanic data to study MJO over the equatorial Indian Ocean, with a focus on the initiation process. Key scientific issures are 1) evolution of moisture (and moist static energy), 2) relationships between the evolution and meso-scale convective systems, and 3) roles of the equatorial wave and sea surface condition. Observational Plan: Wide-areal observation network will be constructed over the central Indian Ocean with ships, land-based sites, and a mooring array as a multi-national effort. Currently, intensive observation is scheduled from October 2011 to January 2012. Data Policy: CINDY2011/DYNAMO adopts "timely release and free/open sharing data policy" for all data obtained during field campaign. For more information, see http://www.jamstec.go.jp/iorgc/cindy/

A - C
type: Concept