UNI-EMAU/IBLE
type: Concept
in scheme: providers
definition: The Institute of Botany and Landscape Ecology offers an extensive collections in flora and other plant life. Also, they offer a botanical garden.

ACADEMIC
type: Concept