UAK
type: Concept
in scheme: providers
definition: The School of Fisheries and Ocean Sciences (SFOS) was created by the University of Alaska Board of Regents in 1987 from existing entities housed at several campuses and placed under a single umbrella to be administered as a unit within the University of Alaska Fairbanks. Summary Provided By: http://www.sfos.uaf.edu/about/

ACADEMIC
type: Concept