NON-GOVERNMENT/NON-PROFIT ORGANIZATIONS
type: Concept

PANGEO
type: Concept
change note: 2021-08-09 11:46:54.0 [mmorahan] insert AltLabel (id: null category: primary text: PANGEO language code: en); insert Definition (id: null text: Pangeo is first and foremost a community of people working collaboratively to develop software and infrastructure to enable Big Data geoscience research. Some of the products produced by this community include interconnected software package and deployments of this software in cloud and high-performance-computing environments. Such a deployment is sometimes referred to as a Pangeo Environment. Motivation There are several building crises facing the geoscience community: Big Data: datasets are growing too rapidly and legacy software tools for scientific analysis can’t handle them. This is a major obstacle to scientific progress. Technology Gap: a growing gap between the technological sophistication of industry solutions (high) and scientific software (low). Reproducibility: a fragmentation of software tools and environments renders most geoscience research effectively unreproducible and prone to failure. Pangeo aims to address these challenges through a unified, collaborative effort. Mission Statement Our mission is to cultivate an ecosystem in which the next generation of open-source analysis tools for ocean, atmosphere and climate science can be developed, distributed, and sustained. These tools must be scalable in order to meet the current and future challenges of big data, and these solutions should leverage the existing expertise outside of the geoscience community. Goals To accomplish this mission, we have identified three specific goals. Foster collaboration around the open source scientific python ecosystem for ocean / atmosphere / land / climate science. Support the development with domain-specific geoscience packages. Improve scalability of these tools to handle petabyte-scale datasets on HPC and cloud platforms. language code: en); insert Resource (id: null type: provider url: https://pangeo.io/);
change note: 2021-08-09 11:19:50.0 [mmorahan] Insert Concept add broader relation (PANGEO [c699c446-bed7-4b8f-987a-6d5b36ad9984,706559] - NON-GOVERNMENT/NON-PROFIT ORGANIZATIONS [f8762581-b92f-48f9-b077-964ee6b0c8ee,693051]);
definition: Pangeo is first and foremost a community of people working collaboratively to develop software and infrastructure to enable Big Data geoscience research. Some of the products produced by this community include interconnected software package and deployments of this software in cloud and high-performance-computing environments. Such a deployment is sometimes referred to as a Pangeo Environment. Motivation There are several building crises facing the geoscience community: Big Data: datasets are growing too rapidly and legacy software tools for scientific analysis can’t handle them. This is a major obstacle to scientific progress. Technology Gap: a growing gap between the technological sophistication of industry solutions (high) and scientific software (low). Reproducibility: a fragmentation of software tools and environments renders most geoscience research effectively unreproducible and prone to failure. Pangeo aims to address these challenges through a unified, collaborative effort. Mission Statement Our mission is to cultivate an ecosystem in which the next generation of open-source analysis tools for ocean, atmosphere and climate science can be developed, distributed, and sustained. These tools must be scalable in order to meet the current and future challenges of big data, and these solutions should leverage the existing expertise outside of the geoscience community. Goals To accomplish this mission, we have identified three specific goals. Foster collaboration around the open source scientific python ecosystem for ocean / atmosphere / land / climate science. Support the development with domain-specific geoscience packages. Improve scalability of these tools to handle petabyte-scale datasets on HPC and cloud platforms.
in scheme: providers