GUST PROBES
type: Concept
change note: 2021-08-05 12:15:30.0 [sritz] insert AltLabel (id: null category: primary text: GUST PROBES language code: en);
in scheme: instruments
definition: GUST PROBES are air velocity sensing instruments usually mounted on the front of an aircraft that resolves turbulent fluctuations in all three components relative to the aircraft; includes pressure probes, vanes, and heated wires (hot-wire anemometers); it measures air velocity relative to the earth corrected for the aircraft attitude and velocity.

Current/Wind Meters
type: Concept