FISHERIES
type: Concept
in scheme: sciencekeywords
definition: Related to the act, process, or season of taking fish or other sea animals; includes marine and non-marine environments, excludes fish farming, hatcheries, and other aquaculture.

AGRICULTURAL AQUATIC SCIENCES
type: Concept