CLOUD DYNAMICS
type: Concept

RADIATIONAL DIVERGENCE
type: Concept
change note: 2017-03-15 17:27:46.0 [sritz] insert Definition (id: null text: The expansion or spreading out of radiation in clouds. language code: en);
change note: 2013-02-14 12:42:20.0 [mpmorahan] Insert Concept add broader relation (RADIATIONAL DIVERGENCE [c7259da4-18dd-4196-91ff-a68087978349,82291] - CLOUD DYNAMICS [62019831-aaba-4d63-a5cd-73138ccfa5d0,82131]);
in scheme: sciencekeywords
definition: The expansion or spreading out of radiation in clouds.