FIRE II
type: Concept
in scheme: projects
definition: The Ground Based Remote Sensing Information Site is a resource for quickly perusing data collected at the SHEBA ice station for the days on which there were FIRE-ACE aircraft overhead. You can browse and download radar and lidar data, as well as browse rawinsonde and DOE/ARM quick look data sets. Summary Provided By: http://asd-www.larc.nasa.gov/fire/

D - F
type: Concept