DATA MANAGEMENT/DATA HANDLING
type: Concept

ARCHIVING
type: Concept
change note: 2017-03-30 07:29:24.0 [tstevens] undo move delete narrower relation (null);
change note: 2017-03-30 07:29:10.0 [tstevens] Move Concepts add narrower relation (ARCHIVING [c75db4f8-716c-47a8-a2f4-34e5a48296b0,86405] - CATALOGING [434d40e2-4e0b-408a-9811-ff878f4f0fb0,84023]);
in scheme: sciencekeywords
definition: Archiving services are defined as Data Handling Services that function to provide storage of Earth science data for later retrieval. Archive services may store the data in any manner but must allow for access and retrieval by a data requestor. This service also includes any tools that facilitate the handling of data into (storage/ingest) or out of (access/retrieval) an archive. EXAMPLES: NASA's Distributed Active Archive Centers (DAACs), Library of Congress.