DATA ALIGNMENT SERVICES
type: Concept
in scheme: sciencekeywords
definition: Service that adjusts sensor geometry models to improve the match of a coverage (or image) with other coverages and/or known ground positions.

DATA PROCESSING SERVICES
type: Concept