TSI APS-3321
type: Concept
change note: 2021-12-14 08:52:12.0 [tstevens] Insert Concept add broader relation (TSI APS-3321 [c8b31982-b01f-4fec-8b0b-87f3ce442dbd,835983] - Chemical Meters/Analyzers [3d25724b-832f-4a61-b0b2-4f2ccecdba94,827335]);
in scheme: instruments
definition: The Aerodynamic Particle Sizer3321 spectrometer provides high-resolution, real-time aerodynamic measurements of particles from 0.5 to 20 microns. These unique particle sizers also measures light-scattering intensity in the equivalent optical size range of 0.37 to 20 microns. By providing paired data for each particle, the APS spectrometer opens up exciting new possibilities for those interested in studying the makeup of an aerosol.

Chemical Meters/Analyzers
type: Concept