CA/DFO/PR/SB/
type: Concept
in scheme: providers
definition: The mission of Fisheries and Oceans Canada Science is to provide high quality knowledge, products and scientific advice on Canadian aquatic ecosystems and living resources. From the open ocean to the laboratory, scientists in Canada's Pacific Region conduct research throughout the North Pacific, coastal and interior British Columbia, the Yukon, as well as the Western Arctic. Summary Provided By: http://www.pac.dfo-mpo.gc.ca/sci/default_e.htm

CANADA
type: Concept