UK-MM-PAF
type: Concept
change note: 2013-01-09 11:21:52.0 [mpmorahan] Insert Concept add broader relation (UK-MM-PAF [c9b56d76-c485-4382-89f1-bbcb4c078894,82067] - COMMERCIAL [1bb6821d-8534-40ce-a6ee-7c88ce4d3c9f,66463]);
in scheme: providers
definition: United Kingdom Multi-Mission Processing and Archiving Facility

COMMERCIAL
type: Concept