RIDGE
type: Concept
change note: 2013-04-02 08:28:44.0 [tbs1979] insert Definition (id: null text: A geological feature that features a chain of mountains or hills that are of a continuous elevated crest for some distance. Ridges are usually termed hills or mountains as well, depending on size. language code: en);
change note: 2013-02-18 12:01:11.0 [tbs1979] Insert Concept add broader relation (RIDGE [ca091be1-4762-49ec-859b-a1a2fcb8e038,82537] - TECTONIC LANDFORMS [46172bbe-8bf0-49a0-848f-129c089aeb8e,63407]);
in scheme: sciencekeywords
definition: A geological feature that features a chain of mountains or hills that are of a continuous elevated crest for some distance. Ridges are usually termed hills or mountains as well, depending on size.

TECTONIC LANDFORMS
type: Concept