HEAT WAVE
type: Concept
change note: 2016-06-28 14:19:49.0 [saritz] update Definition ((Also called hot wave, warm wave.) A period of abnormally and uncomfortably hot and usually humid weather. To be a heat wave such a period should last at least one day, but conventionally it lasts from several days to several weeks. In 1900, A. T. Burrows more rigidly defined a "hot wave" as a spell of three or more days on each of which the maximum shade temperature reaches or exceeds 90°F. More realistically, the comfort criteria for any one region are dependent upon the normal conditions of that region. In the eastern United States, heat waves generally build up with southerly winds on the western flank of an anticyclone centered over the southeastern states, the air being warmed by passage over a land surface heated by the sun.);
change note: 2016-06-28 14:18:28.0 [saritz] insert Definition (id: null text: (Also called hot wave, warm wave.) A period of abnormally and uncomfortably hot and usually humid weather. language code: en);
change note: 2016-06-28 14:10:32.0 [saritz] Insert Concept add broader relation (HEAT WAVE [ca820557-401e-4e5e-ac32-29fdbc0628b3,217733] - ATMOSPHERIC PHENOMENA [b7d562cf-9b9b-4461-900b-50423a8c4d29,83679]);
in scheme: sciencekeywords
definition: (Also called hot wave, warm wave.) A period of abnormally and uncomfortably hot and usually humid weather. To be a heat wave such a period should last at least one day, but conventionally it lasts from several days to several weeks. In 1900, A. T. Burrows more rigidly defined a "hot wave" as a spell of three or more days on each of which the maximum shade temperature reaches or exceeds 90°F. More realistically, the comfort criteria for any one region are dependent upon the normal conditions of that region. In the eastern United States, heat waves generally build up with southerly winds on the western flank of an anticyclone centered over the southeastern states, the air being warmed by passage over a land surface heated by the sun.

WEATHER EVENTS
type: Concept