ULTRAVIOLET WAVELENGTHS
type: Concept

ULTRAVIOLET RADIANCE
type: Concept
in scheme: sciencekeywords
definition: In radiometery, a measure of the intrinsic radiant intensity emitted by a radiator in a given direction. Radiance is measured in watts per square meter and steradian.