ACADEMIC
type: Concept

UC-SB/BREN-ENVI/SNOW
type: Concept
in scheme: providers
definition: The Snow Hydrology Research Group is part of the Donald Bren School of Environmental Science and Management at the University of California, Santa Barbara. It is also a member of the ESIP Federation (Earth Science Information Partners). The primary research focus of this group is NASA's REASoN (Research, Education and Applications Solutions Network) investigation called "Multi-Resolution Snow Products for the Hydrologic Sciences." The group also works on problems of snow metamorphism, snow-climate interactions, and snowmelt runoff. Much of this work is conducted at the Environmental Information Laboratory within the Donald Bren School.