FORESTS
type: Concept

BOREAL FOREST/TIAGA
type: Concept
change note: 2016-06-13 10:11:54.0 [gee-cee] insert Definition (id: null text: Pertaining to subarctic forest consisting of primarily of short conifer trees and characterized by intensely cold winters, short summers, and high annual variation in temperature. language code: en);
change note: 2016-06-13 10:11:26.0 [gee-cee] Insert Concept add broader relation (BOREAL FOREST/TIAGA [cafa8131-4a2d-4c8b-811c-0d64adf5fc06,188175] - FORESTS [46e4aaa4-349c-4049-a910-035391360010,83507]);
in scheme: sciencekeywords
definition: Pertaining to subarctic forest consisting of primarily of short conifer trees and characterized by intensely cold winters, short summers, and high annual variation in temperature.