INOVAGIS
type: Concept
in scheme: providers
definition: The inovaGIS.org is a small community of people developing free software in Visual Basic, Delphi/Kylix and ASP for common, simple applications that use geographic information. Right now our focus is on porting our library of geographic objects to Kylix (LINUX) as open source, developing web services using SOAP, and in OpenGIS specifications with the development of the GIServer. We don't have any business-model, we just share GIS methods and algorithms in a collaborative effort. Feel free to join us and participate in the forum discussions (or simply go to the download section).

CONSORTIA/INSTITUTIONS
type: Concept