CLOUD DROPLET DISTRIBUTION
type: Concept
change note: 2013-03-20 18:43:50.0 [mpmorahan] Undo delete delete broader relation (null); add broader relation (CLOUD DROPLET DISTRIBUTION [cbb0d517-462a-46fe-a0e6-32555f7e7f23,82051] - CLOUDS [162e2243-3266-4999-b352-d8a1a9dc82ac,62017]); delete concept (false);
change note: 2013-03-20 14:48:08.0 [mpmorahan] Remove Concepts delete broader relation (null); delete concept (true); add broader relation (CLOUD DROPLET DISTRIBUTION [cbb0d517-462a-46fe-a0e6-32555f7e7f23,82051] - Trash Can/Science Keywords [c5a4126a-8f0a-4774-9bef-c2a9f9487727,81949]);
change note: 2012-12-20 18:09:11.0 [saritz] Insert Concept add broader relation (CLOUD DROPLET DISTRIBUTION [cbb0d517-462a-46fe-a0e6-32555f7e7f23,82051] - CLOUDS [162e2243-3266-4999-b352-d8a1a9dc82ac,62017]);
in scheme: sciencekeywords
definition: The physical size of water droplets and the distribution of water droplets recorded within a cloud.

CLOUDS
type: Concept