WASTEWATER MANAGEMENT
type: Concept
definition: The management of wastewater or sewage, often in the form of treatment that removes contaminants and impurities so that the water can be directly reused or returned to aquifers or natural bodies of water.
in scheme: sciencekeywords
alternative label: Wastewater Treatment
alternative label: Sewage Treatment
alternative label: Sewage Management
change note: 2019-06-03 14:53:01.0 [mmorahan] Rename Concept update PrefLabel (WASTEWATER MANAGEMENT);
change note: 2019-05-30 09:24:16.0 [mmorahan] Insert Concept add broader relation (Wastewater Management [cbf64c32-99fa-4312-91a0-4fc85a6890bb,368875] - WATER MANAGEMENT [14555831-70ae-4650-8983-956d65595575,85065]);

WATER MANAGEMENT
type: Concept