CA/EC/CWS
type: Concept
in scheme: providers
definition: The Canadian Wildlife Service (CWS), part of Environment Canada, handles wildlife matters that are the responsibility of the federal government. These include protection and management of migratory birds, nationally significant habitat and endangered species, as well as work on other wildlife issues of national and international importance. Website: "http://www.cws-scf.ec.gc.ca/" [Summary provided by National Wildlife Research Centre, Canadian Wildlife Service, Environment Canada]

CANADA
type: Concept