STS-99
type: Concept
change note: 2018-09-18 16:38:54.0 [sritz] update WeightedRelation (Platform-Instrument); update WeightedRelation (1);
change note: 2021-11-30 12:32:40.0 [tstevens] Move Concepts delete broader relation (null); add broader relation (STS-99 [cc33ee94-f31e-4e4a-a659-f5c6fc244710,826750] - SPACE SHUTTLE [3ef93fbf-1e19-42a9-a91f-502d125dbb7c,826168]);
change note: 2021-11-30 12:04:43.0 [tstevens] Move Concepts delete broader relation (null); add broader relation (STS-99 [cc33ee94-f31e-4e4a-a659-f5c6fc244710,826750] - Space-based Platforms [b39a69b4-c3b9-4a94-b296-bbbbe5e4c847,835875]);
change note: 2021-11-30 12:12:05.0 [tstevens] Move Concepts delete broader relation (null); add broader relation (STS-99 [cc33ee94-f31e-4e4a-a659-f5c6fc244710,826750] - Space Stations/Crewed Spacecraft [388e72a1-b851-4b78-9e69-747e06ae215f,826132]);
change note: 2018-09-18 16:38:21.0 [sritz] insert WeightedRelation (id: null related concept uuid: 7b241f5e-a68a-491a-830b-22ecf48a57e3 relationship type: null relationship value: null generated by: null);
definition: The primary objective of the STS-99 mission was to complete high resolution mapping of large sections of the Earth's surface using the Shuttle Radar Topography Mission (SRTM), a specially modified radar system. This radar system produced unrivaled 3-D images of the Earth's Surface. The mission was launched at 1231 on February 11, 2000 onboard the space shuttle Endeavour, and led by Commander Kevin Kregel. The crew was Pilot Dominic L. Pudwill Gorie and Mission Specialists Janet L. Kavandi, Janice E. Voss, Mamoru Mohri from the National Space Development Agency (Japanese Space Agency), and Gerhard P. J. Thiele from DARA (German Space Agency). This videotape shows a press briefing about a mechanical problem that the shuttle was having. There was discussion about possibly scrubbing the launch due to the problem with the Enhanced Master Events Controller. A problem with a fuel pump part had also become evident and there was discussion about the impact that this could have on the flight. Group: Platform_Details Entry_ID: STS-99 Group: Platform_Identification Platform_Category: Space Stations/Manned Spacecraft Platform_Series_or_Entity: SPACE SHUTTLE Short_Name: STS-99 Long_Name: Space Transport System STS-99 End_Group Group: Platform_Associated_Instruments Short_Name: CAMERAS Short_Name: SRTM End_Group Group: Orbit Orbit_Altitude: 126 nm Orbit_Inclination: 57 degrees End_Group Creation_Date: 2007-08-21 Online_Resource: http://science.ksc.nasa.gov/shuttle/missions/sts-99/mission-sts-99.html Group: Platform_Logistics Launch_Date: 2000-02-11 Launch_Site: Cape Canaveral/Kennedy Space Center, USA Primary_Sponsor: USA/NASA End_Group End_Group
in scheme: platforms

Space Shuttle
type: Concept