Earth Observation Satellites
type: Concept

MIDAS 2
type: Concept
in scheme: platforms
definition: The MIDAS 2 (Missile Defense Alarm System) satellite was an earth-orbiting satellite designed to measure IR background and define IR sources. In addition, the satellite carried experiments to measure cosmic radiation, atmospheric density, thermal emission and reflected solar radiation from the earth, and micrometeorites. A plasma probe was included too. The spacecraft was chemical-battery powered. IR radiation data were received for the lifetime of the battery pack, which powered the final transmission on May 26, 1960. __________ Taken from the NSSDC System for Information Retrieval and Storage (SIRS). For more information contact the NSSDC Coordinated Request and User Support Office, 301-286-6695 (NASA Goddard Space Flight Center, Code 933.4, Greenbelt, Maryland 20771, USA).