AAE
type: Concept
in scheme: projects
definition: Sir Douglas Mawson (1882-1958) is Australia's most renowned Antarctic scientist and explorer. In 1911 Mawson organized and commanded the Australasian Antarctic Expedition (AAE 1911-14) and was the sole survivor of a three-man sledging journey that ended tragically. While there, they studies the landscape and the ecosystem of the Antarctic. For additional information on Sir Douglas Mawson and the project link to "http://209.207.189.31/antarctic/history/"

A - C
type: Concept