CARBON AND HYDROCARBON COMPOUNDS
type: Concept

CHLORINATED HYDROCARBONS
type: Concept
in scheme: sciencekeywords
definition: The presence of pesticides or PCB (POLYCHLORINATED BIPHENYL) in the Atmosphere.