ACADEMIC
type: Concept

BU/ES/ARG
type: Concept
change note: 2015-10-07 11:23:39.0 [aaleman] added new data center insert AltLabel (id: null text: Boston University, Department of Earth Sciences, Antarctic Research Group Data Repository language code: en);
change note: 2015-10-07 11:21:30.0 [aaleman] Insert Concept add broader relation (BU/ES/ARG [cdcbad72-0ec2-449b-b0f5-0ce1dde2a0d7,158421] - ACADEMIC [7700280b-68ee-4644-bf5e-84e7a6adf897,135979]);
in scheme: providers
definition: Research Themes Include: Climate Evolution Cenozoic Vegetation History of Antarctica Ice Sheet Dynamics East Antarctic Ice Sheet Evolution West Antarctic Ice Sheet Dynamics Mars Mars-Antarctic Analogs Process Geomorphology Buried Ice Deposits in Antarctica Surface Processes & Numerical Modeling Cosmogenic Nuclide Dating Salt Geochemistry Tephrachronology & Landscape Evolution in the Dry Valleys "Virtual" Fieldwork Digital Image Analysis