SEDIMENTARY TEXTURES
type: Concept
in scheme: sciencekeywords
definition: The characterization of sediment by the size of individual particles; the classification of sediment by particle-size classes.

MARINE SEDIMENTS
type: Concept