NON-GOVERNMENT/NON-PROFIT ORGANIZATIONS
type: Concept

UNAVCO
type: Concept
in scheme: providers
definition: UNAVCO fosters communication for and by scientists and educators throughout its membership who are affiliated with member universities and other scientific institutions, has funding sponsors, and is run through a governance structure. UNAVCO hosts meetings and events for its members, and encourages the community to join the discussion through our email lists, discussion forums, and other social media interactions. UNAVCO publishes a variety of publications, proposals, and reports for use by scientists and educators affiliated with its member institutions.