UWI-MAD/SSEC/ASIPS
type: Concept
change note: 2018-04-02 14:57:07.0 [tstevens] insert AltLabel (id: null category: primary text: Atmosphere Science Investigator-led Processing System, Space Science and Engineering Center, University of Wisconsin-Madison language code: en); insert Definition (id: null text: The Atmosphere SIPS, located at the University of Wisconsin - Madison, Space Science and Engineering Center, processes data from the Suomi NPP satellite to produce VIIRS Level 2 cloud and aerosol products. The products generated by the Atmosphere SIPS are archived and distributed by the Level 1 and Atmospheric Archive and Distribution System (LAADS). language code: en); insert Resource (id: null type: provider url: https://sips.ssec.wisc.edu/);
change note: 2018-04-02 14:54:49.0 [tstevens] Insert Concept add broader relation (UWI-MAD/SSEC/ASIPS [cf78935a-e763-4633-b8d6-544f1e4d7c6a,367455] - ACADEMIC [7700280b-68ee-4644-bf5e-84e7a6adf897,337181]);
in scheme: providers
definition: The Atmosphere SIPS, located at the University of Wisconsin - Madison, Space Science and Engineering Center, processes data from the Suomi NPP satellite to produce VIIRS Level 2 cloud and aerosol products. The products generated by the Atmosphere SIPS are archived and distributed by the Level 1 and Atmospheric Archive and Distribution System (LAADS).

ACADEMIC
type: Concept