CARBON TETRAFLUORIDE
type: Concept
change note: 2022-03-03 16:38:13.0 [sritz] Insert Concept add broader relation (CARBON TETRAFLUORIDE [cf96b289-d316-4abc-8540-b8849e2f6140,836056] - HALOCARBONS AND HALOGENS [d46a5046-e1c6-4a09-a2f1-db6a21eda611,832624]);
in scheme: sciencekeywords
definition: Tetrafluoromethane is a colorless nonflammable gas. It is shipped as a liquid under pressure. It may be narcotic at high concentrations. Under prolonged exposure to fire or heat the containers may rupture violently and rocket. It is used as a refrigerant.

HALOCARBONS AND HALOGENS
type: Concept