FEED COMPOSITION
type: Concept
in scheme: sciencekeywords
definition: Any measure related to the composition of harvested forage, such as hay, fodder, silage, grain, or other processed feed for livestock. May include new mixes, new types, etc..., and any additives.

FEED PRODUCTS
type: Concept