SEA ICE
type: Concept

SEA ICE MASS BALANCE
type: Concept
change note: 2023-02-24 12:24:08.0 [sritz] insert Definition (id: null text: The net balance between the sea ice mass gained by freezing and the loss of mass by melting that is a function of its extent and thickness, which combine to give its volume. language code: en);
change note: 2023-02-24 12:22:29.0 [sritz] Insert Concept add broader relation (SEA ICE MASS BALANCE [cfc3ed52-a7e2-4ad1-8330-1f97c7cb0203,1232203] - SEA ICE [860e2af9-ce29-4f3f-b027-ae3747eb3e01,1228768]);
in scheme: sciencekeywords
definition: The net balance between the sea ice mass gained by freezing and the loss of mass by melting that is a function of its extent and thickness, which combine to give its volume.