TAMU/GERG
type: Concept
in scheme: providers
definition: The Geochemical and Environmental Research Group (GERG) is a center of excellence in applied geosciences within the College of Geosciences of Texas A&M University. Texas A&M University has a long history of accomplishments in education, research and public service since it was founded in 1876. The University provides support for public needs by making available its resources, experience, and personnel in a wide array of science and technological disciplines. The resources of Texas A&M University are available to address the needs of the government and private sectors. These resources are particularly relevant to projects that require broad multi-disciplinary approaches, that need innovative and complex technologies, that have the potential for applied research spin-offs, that utilize undergraduate and graduate students as part of the project team, that have educational components, and that are for the public good. Website: "http://www.gerg.tamu.edu/" [Summary provided by Texas A & M University.]

ACADEMIC
type: Concept